Reaction Details
TargetATP-sensitive inward rectifier potassium channel 1
LigandBDBM50235196
Substrate/Competitorn/a
Meas. Tech.Thallium Flux Assay
IC50 44.1±n/a nM
Citation Tang, HPio, BJiang, JPasternak, ADong, SFerguson, II, RDGuo, ZZChobanian, HFrie, JGuo, YWu, ZYu, YWang, M Inhibitors of the renal outer medullary potassium channel US Patent US9751881 Publication Date 9/5/2017
 
ATP-sensitive inward rectifier potassium channel 1
Name:ATP-sensitive inward rectifier potassium channel 1
Type:Enzyme Catalytic Domain
Mol. Mass.:44809.08
Organism:Homo sapiens (Human)
Description:gi_223460826
Residue:391
BDBM50235196
NameBDBM50235196
Synonyms:CHEMBL4064760
TypeSmall organic molecule
Emp. Form.C24H30N4O5S
Mol. Mass.486.584
SMILESCc1c2COC(=O)c2ccc1[C@@H](O)CN1CCC2(CCN(C2)c2cnc(cn2)S(C)(=O)=O)CC1