Reaction Details
TargetHistone deacetylase 1
LigandBDBM103537
Substrate/Competitorn/a
Meas. Tech.In Vitro HDAC Assay
IC50 1520±n/a nM
Citation Chen, DSong, HYSun, ETYu, NZou, Y Benzimidazole derivatives: preparation and pharmaceutical applications US Patent US10201527 Publication Date 2/12/2019
 
Histone deacetylase 1
Name:Histone deacetylase 1
Type:Enzyme
Mol. Mass.:55090.27
Organism:Homo sapiens (Human)
Description:Q13547
Residue:482
BDBM103537
NameBDBM103537
Synonyms:US10201527, Compound 7 US8551988, 7
TypeSmall organic molecule
Emp. Form.C27H27N3O6
Mol. Mass.489.5198
SMILESCOc1cc(ccc1OCc1ccccc1)-c1nc2cc(\C=C\C(=O)NO)ccc2n1CC(O)CO