Reaction Details
TargetTyrosine-protein phosphatase non-receptor type 2
LigandBDBM13975
Substrate/CompetitorBDBM13466
Meas. Tech.PTP1B and TCPTP Inhibition Assay
Ki 160±n/a nM
Citation Liu, GSzczepankiewicz, BGPei, ZJanowick, DAXin, ZHajduk, PJAbad-Zapatero, CLiang, HHutchins, CWFesik, SWBallaron, SJStashko, MALubben, TMika, AKZinker, BATrevillyan, JMJirousek, MR Discovery and structure-activity relationship of oxalylarylaminobenzoic acids as inhibitors of protein tyrosine phosphatase 1B. J Med Chem46:2093-103 (2003) 
 
Tyrosine-protein phosphatase non-receptor type 2
Name:Tyrosine-protein phosphatase non-receptor type 2
Type:Protein
Mol. Mass.:48481.80
Organism:Homo sapiens (Human)
Description:P17706
Residue:415
BDBM13975
BDBM13466
NameBDBM13975
Synonyms:2-({2-[(1E)-2-carbamoyleth-1-en-1-yl]-4-[(2S)-2-methanesulfonamido-2-(pentylcarbamoyl)ethyl]phenyl}amidoformic acid)benzoic acid Oxalylarylaminobenzoic Acid Analog 17
TypeSmall organic molecule
Emp. Form.C27H32N4O9S
Mol. Mass.588.629
SMILESCCCCCNC(=O)[C@H](Cc1ccc(N(C(=O)C(O)=O)c2ccccc2C(O)=O)c(\C=C\C(N)=O)c1)NS(C)(=O)=O