Reaction Details
TargetTyrosine-protein phosphatase non-receptor type 1 [1-298]
LigandBDBM13976
Substrate/CompetitorBDBM13466
Meas. Tech.PTP1B and TCPTP Inhibition Assay
pH7.5±n/a
Temperature295.15±n/a K
Ki 18000±n/a nM
Citation Xin, ZLiu, GAbad-Zapatero, CPei, ZSzczepankiewicz, BGLi, XZhang, THutchins, CWHajduk, PJBallaron, SJStashko, MALubben, THTrevillyan, JMJirousek, MR Identification of a monoacid-based, cell permeable, selective inhibitor of protein tyrosine phosphatase 1B. Bioorg Med Chem Lett13:3947-50 (2003) 
 
Tyrosine-protein phosphatase non-receptor type 1 [1-298]
Name:Tyrosine-protein phosphatase non-receptor type 1 [1-298]
Type:Enzyme
Mol. Mass.:34670.65
Organism:Homo sapiens (Human)
Description:The catalytic domain of PTP 1B (residues 1-298) was expressed and purified from E. coli.
Residue:298
BDBM13976
BDBM13466
NameBDBM13976
Synonyms:Aminobenzoic acid analog 5 | CHEMBL116605
TypeSmall organic molecule
Emp. Form.C34H37N3O11
Mol. Mass.663.6711
SMILESCCc1cc(CC(NC(C)=O)C(=O)NCCCCOc2cccc(O)c2C(=O)OC)ccc1N(C(=O)C(O)=O)c1ccccc1C(O)=O