Reaction Details
TargetTyrosine-protein phosphatase non-receptor type 1 [1-298]
LigandBDBM13989
Substrate/CompetitorBDBM13466
Meas. Tech.PTP1B and TCPTP Inhibition Assay
pH7.5±n/a
Temperature295.15±n/a K
Ki>200000±n/a nM
Citation Xin, ZLiu, GAbad-Zapatero, CPei, ZSzczepankiewicz, BGLi, XZhang, THutchins, CWHajduk, PJBallaron, SJStashko, MALubben, THTrevillyan, JMJirousek, MR Identification of a monoacid-based, cell permeable, selective inhibitor of protein tyrosine phosphatase 1B. Bioorg Med Chem Lett13:3947-50 (2003) 
 
Tyrosine-protein phosphatase non-receptor type 1 [1-298]
Name:Tyrosine-protein phosphatase non-receptor type 1 [1-298]
Type:Enzyme
Mol. Mass.:34670.65
Organism:Homo sapiens (Human)
Description:The catalytic domain of PTP 1B (residues 1-298) was expressed and purified from E. coli.
Residue:298
BDBM13989
BDBM13466
NameBDBM13989
Synonyms:1:1 racemic mixture phosphotyrosyl mimetic 22
TypeSmall organic molecule
Emp. Form.C25H31N3O9
Mol. Mass.517.5283
SMILESCOC(=O)c1c(O)cccc1OCCCCNC(=O)C(Cc1ccc(OCC(O)=O)c(N)c1)NC(C)=O