Reaction Details
TargetTyrosine-protein phosphatase non-receptor type 2
LigandBDBM13977
Substrate/CompetitorBDBM13466
Meas. Tech.PTP1B and TCPTP Inhibition Assay
pH7.5±n/a
Temperature295.15±n/a K
Ki 141000±n/a nM
Citation Xin, ZLiu, GAbad-Zapatero, CPei, ZSzczepankiewicz, BGLi, XZhang, THutchins, CWHajduk, PJBallaron, SJStashko, MALubben, THTrevillyan, JMJirousek, MR Identification of a monoacid-based, cell permeable, selective inhibitor of protein tyrosine phosphatase 1B. Bioorg Med Chem Lett13:3947-50 (2003) 
 
Tyrosine-protein phosphatase non-receptor type 2
Name:Tyrosine-protein phosphatase non-receptor type 2
Type:Protein
Mol. Mass.:48481.80
Organism:Homo sapiens (Human)
Description:P17706
Residue:415
BDBM13977
BDBM13466
NameBDBM13977
Synonyms:({4-[(2S)-2-{[(tert-butoxy)carbonyl]amino}-2-({4-[3-hydroxy-2-(methoxycarbonyl)phenoxy]butyl}carbamoyl)ethyl]phenyl}carbamoyl)formic acid | phosphotyrosyl mimetic 8
TypeSmall organic molecule
Emp. Form.C28H35N3O10
Mol. Mass.573.5916
SMILESCOC(=O)c1c(O)cccc1OCCCCNC(=O)[C@H](Cc1ccc(NC(=O)C(O)=O)cc1)NC(=O)OC(C)(C)C