Reaction Details
TargetFibroblast growth factor receptor 2
LigandBDBM339819
Substrate/Competitorn/a
Meas. Tech.FGFR2 (Enzymatic Assay)
IC50 3.24±n/a nM
Citation Angibaud, PRObringer, MMarin, JJJeanty, M Naphthyridine derivative compounds US Patent US9757364 Publication Date 9/12/2017
 
Fibroblast growth factor receptor 2
Name:Fibroblast growth factor receptor 2
Type:Enzyme
Mol. Mass.:92015.45
Organism:Homo sapiens (Human)
Description:P21802
Residue:821
BDBM339819
NameBDBM339819
Synonyms:US9757364, Compound 13
TypeSmall organic molecule
Emp. Form.C26H32N6O2
Mol. Mass.460.5713
SMILESCCn1cc(cn1)-c1cnc2ccc(nc2c1)N(CCNC(C)C)c1cc(OC)cc(OC)c1