Reaction Details
TargetFibroblast growth factor receptor 4
LigandBDBM339819
Substrate/Competitorn/a
Meas. Tech.FGFR4 (Enzymatic Assay)
IC50 6.31±n/a nM
Citation Angibaud, PRObringer, MMarin, JJJeanty, M Naphthyridine derivative compounds US Patent US9757364 Publication Date 9/12/2017
 
Fibroblast growth factor receptor 4
Name:Fibroblast growth factor receptor 4
Type:Protein
Mol. Mass.:87957.45
Organism:Homo sapiens (Human)
Description:P22455
Residue:802
BDBM339819
NameBDBM339819
Synonyms:US9757364, Compound 13
TypeSmall organic molecule
Emp. Form.C26H32N6O2
Mol. Mass.460.5713
SMILESCCn1cc(cn1)-c1cnc2ccc(nc2c1)N(CCNC(C)C)c1cc(OC)cc(OC)c1