Reaction Details
TargetTyrosine-protein kinase BTK
LigandBDBM340143
Substrate/Competitorn/a
Meas. Tech.Btk Enzyme Activity
EC50<10.00±n/a nM
Citation Barf, TAJans, CGde Man, APOubrie, AARaaijmakers, HCRewinkel, JBSterrenburg, JGWijkmans, JC 4-imidazopyridazin-1-yl-benzamides as Btk inhibitors US Patent US9758524 Publication Date 9/12/2017
 
Tyrosine-protein kinase BTK
Name:Tyrosine-protein kinase BTK
Type:Enzyme
Mol. Mass.:76289.95
Organism:Homo sapiens (Human)
Description:Q06187
Residue:659
BDBM340143
NameBDBM340143
Synonyms:US10239883, Example 32 US9758524, Example 32
TypeSmall organic molecule
Emp. Form.C28H27N7O3
Mol. Mass.509.5591
SMILESCC(C)(O)C#CC(=O)N1CCC[C@H]1c1nc(-c2ccc(cc2)C(=O)Nc2ccccn2)c2c(N)nccn12