Reaction Details
TargetProto-oncogene tyrosine-protein kinase Src
LigandBDBM340085
Substrate/Competitorn/a
Meas. Tech.Src Enzyme Activity
EC50>1000±n/a nM
Citation Barf, TAJans, CGde Man, APOubrie, AARaaijmakers, HCRewinkel, JBSterrenburg, JGWijkmans, JC 4-imidazopyridazin-1-yl-benzamides as Btk inhibitors US Patent US9758524 Publication Date 9/12/2017
 
Proto-oncogene tyrosine-protein kinase Src
Name:Proto-oncogene tyrosine-protein kinase Src
Type:Protein
Mol. Mass.:59838.60
Organism:Homo sapiens (Human)
Description:P12931
Residue:536
BDBM340085
NameBDBM340085
Synonyms:US10239883, Example 24 US9758524, Example 24
TypeSmall organic molecule
Emp. Form.C25H23N7O3
Mol. Mass.469.4952
SMILESCC#CC(=O)N1CCCC[C@H]1c1nc(-c2ccc(cc2)C(=O)Nc2ccon2)c2c(N)nccn12