Reaction Details
TargetTyrosine-protein kinase Fyn
LigandBDBM340129
Substrate/Competitorn/a
Meas. Tech.FynT Enzyme Activity
EC50>1000±n/a nM
Citation Barf, TAJans, CGde Man, APOubrie, AARaaijmakers, HCRewinkel, JBSterrenburg, JGWijkmans, JC 4-imidazopyridazin-1-yl-benzamides as Btk inhibitors US Patent US9758524 Publication Date 9/12/2017
 
Tyrosine-protein kinase Fyn
Name:Tyrosine-protein kinase Fyn
Type:Enzyme
Mol. Mass.:60762.21
Organism:Homo sapiens (Human)
Description:P06241
Residue:537
BDBM340129
NameBDBM340129
Synonyms:US10239883, Example 17 US9758524, Example 17
TypeSmall organic molecule
Emp. Form.C26H24FN7O2
Mol. Mass.485.5129
SMILESNc1nccn2c(nc(-c3ccc(cc3)C(=O)Nc3cc(F)ccn3)c12)[C@@H]1CCCCN1C(=O)C=C