Reaction Details
TargetTyrosine-protein kinase Lyn
LigandBDBM340083
Substrate/Competitorn/a
Meas. Tech.Lyn Enzyme Activity
EC50>1000±n/a nM
Citation Barf, TAJans, CGde Man, APOubrie, AARaaijmakers, HCRewinkel, JBSterrenburg, JGWijkmans, JC 4-imidazopyridazin-1-yl-benzamides as Btk inhibitors US Patent US9758524 Publication Date 9/12/2017
 
Tyrosine-protein kinase Lyn
Name:Tyrosine-protein kinase Lyn
Type:Protein
Mol. Mass.:58575.92
Organism:Homo sapiens (Human)
Description:P07948
Residue:512
BDBM340083
NameBDBM340083
Synonyms:US10239883, Example 7 US9758524, Example 7
TypeSmall organic molecule
Emp. Form.C28H29FN8O2
Mol. Mass.528.5807
SMILESCN(C)C\C=C\C(=O)N1CCC[C@H]1c1nc(-c2ccc(cc2)C(=O)Nc2cc(F)ccn2)c2c(N)nccn12