Reaction Details
TargetTyrosine-protein kinase Lyn
LigandBDBM340132
Substrate/Competitorn/a
Meas. Tech.Lyn Enzyme Activity
EC50>1000±n/a nM
Citation Barf, TAJans, CGde Man, APOubrie, AARaaijmakers, HCRewinkel, JBSterrenburg, JGWijkmans, JC 4-imidazopyridazin-1-yl-benzamides as Btk inhibitors US Patent US9758524 Publication Date 9/12/2017
 
Tyrosine-protein kinase Lyn
Name:Tyrosine-protein kinase Lyn
Type:Protein
Mol. Mass.:58575.92
Organism:Homo sapiens (Human)
Description:P07948
Residue:512
BDBM340132
NameBDBM340132
Synonyms:US10239883, Example 20 US9758524, Example 20
TypeSmall organic molecule
Emp. Form.C25H24N8O2
Mol. Mass.468.5105
SMILESNc1nccn2c(nc(-c3ccc(cc3)C(=O)Nc3ncccn3)c12)[C@@H]1CCCCN1C(=O)C=C