Reaction Details
TargetTyrosine-protein kinase Lyn
LigandBDBM340139
Substrate/Competitorn/a
Meas. Tech.Lyn Enzyme Activity
EC50>1000±n/a nM
Citation Barf, TAJans, CGde Man, APOubrie, AARaaijmakers, HCRewinkel, JBSterrenburg, JGWijkmans, JC 4-imidazopyridazin-1-yl-benzamides as Btk inhibitors US Patent US9758524 Publication Date 9/12/2017
 
Tyrosine-protein kinase Lyn
Name:Tyrosine-protein kinase Lyn
Type:Protein
Mol. Mass.:58575.92
Organism:Homo sapiens (Human)
Description:P07948
Residue:512
BDBM340139
NameBDBM340139
Synonyms:US10239883, Example 28 US9758524, Example 28
TypeSmall organic molecule
Emp. Form.C28H27N7O2
Mol. Mass.493.5597
SMILESCC#CC(=O)N1CCCC[C@H]1c1nc(-c2ccc(cc2C)C(=O)Nc2ccccn2)c2c(N)nccn12