Reaction Details
TargetTyrosine-protein kinase Lyn
LigandBDBM340144
Substrate/Competitorn/a
Meas. Tech.Lyn Enzyme Activity
EC50>1000±n/a nM
Citation Barf, TAJans, CGde Man, APOubrie, AARaaijmakers, HCRewinkel, JBSterrenburg, JGWijkmans, JC 4-imidazopyridazin-1-yl-benzamides as Btk inhibitors US Patent US9758524 Publication Date 9/12/2017
 
Tyrosine-protein kinase Lyn
Name:Tyrosine-protein kinase Lyn
Type:Protein
Mol. Mass.:58575.92
Organism:Homo sapiens (Human)
Description:P07948
Residue:512
BDBM340144
NameBDBM340144
Synonyms:(S)-4-(8-Amino-3-(1-(6-chloropyrimidine-4-carbonyl)pyrrolidin-2-yl)imidazo[1,5-a]pyrazin-1-yl)-N-(pyridin-2-yl)benzamide US10934296, Example 33 | US9758524, Example 33
TypeSmall organic molecule
Emp. Form.C27H22ClN9O2
Mol. Mass.539.976
SMILESNc1nccn2c(nc(-c3ccc(cc3)C(=O)Nc3ccccn3)c12)[C@@H]1CCCN1C(=O)c1cc(Cl)ncn1