Reaction Details
TargetTyrosine-protein kinase Lyn
LigandBDBM340149
Substrate/Competitorn/a
Meas. Tech.Lyn Enzyme Activity
EC50>1000±n/a nM
Citation Barf, TAJans, CGde Man, APOubrie, AARaaijmakers, HCRewinkel, JBSterrenburg, JGWijkmans, JC 4-imidazopyridazin-1-yl-benzamides as Btk inhibitors US Patent US9758524 Publication Date 9/12/2017
 
Tyrosine-protein kinase Lyn
Name:Tyrosine-protein kinase Lyn
Type:Protein
Mol. Mass.:58575.92
Organism:Homo sapiens (Human)
Description:P07948
Residue:512
BDBM340149
NameBDBM340149
Synonyms:US10239883, Example 38 US9758524, Example 38
TypeSmall organic molecule
Emp. Form.C26H23N7O3
Mol. Mass.481.5059
SMILESCC#CC(=O)N1CCOC[C@H]1c1nc(-c2ccc(cc2)C(=O)Nc2ccccn2)c2c(N)nccn12