Reaction Details
TargetCREB-binding protein
LigandBDBM340509
Substrate/Competitorn/a
Meas. Tech.TR-FRET Binding Assay
IC50 10.00±n/a nM
Citation Adler, MAlbrecht, BKBronner, SChen, KXCôté, ACrawford, TCyr, PEgen, JKauder, SLai, KWLiao, JMagnuson, SMurray, JPastor, RRomero, FATaylor, AMTsui, VHWang, FZhu, B Therapeutic compounds and uses thereof US Patent US9763922 Publication Date 9/19/2017
 
CREB-binding protein
Name:CREB-binding protein
Type:Transcription Coactivator
Mol. Mass.:265411.66
Organism:Homo sapiens (Human)
Description:Q92793
Residue:2442
BDBM340509
NameBDBM340509
Synonyms:US9763922, Example 40
TypeSmall organic molecule
Emp. Form.C22H25FN6O
Mol. Mass.408.4719
SMILESCC(=O)N1CCc2c(C1)c(Nc1cc(ccc1F)-c1cnn(C)c1)nn2CC1CC1