Reaction Details
TargetCalcium-dependent protein kinase 1
LigandBDBM340945
Substrate/Competitorn/a
Meas. Tech.Biological Assay
IC50 2.20±n/a nM
Citation Van Voorhis, WCHol, WGLarson, ETMaly, DJMerritt, EOjo, KK Compositions and methods for treating toxoplasmosis, cryptosporidiosis, and other apicomplexan protozoan related diseases US Patent US9765037 Publication Date 9/19/2017
 
Calcium-dependent protein kinase 1
Name:Calcium-dependent protein kinase 1
Synonyms:Calcium-dependent protein kinase 1 (CDPK1)
Type:Protein
Mol. Mass.:76617.33
Organism:Cryptosporidium parvum
Description:Q6S4W0
Residue:677
BDBM340945
NameBDBM340945
TypeSmall organic molecule
Emp. Form.C19H21N5
Mol. Mass.319.4035
SMILESCn1ccc2cc(ccc12)-c1nc(n2ccnc(N)c12)C(C)(C)C