Reaction Details
TargetTyrosine-protein phosphatase non-receptor type 2
LigandBDBM14239
Substrate/CompetitorBDBM13466
Meas. Tech.Enzymatic Assay
Temperature298.15±n/a K
Ki 380±n/a nM
Commentsextracted
Citation Moretto, AFKirincich, SJXu, WXSmith, MJWan, ZKWilson, DPFollows, BCBinnun, EJoseph-McCarthy, DForeman, KErbe, DVZhang, YLTam, SKTam, SYLee, J Bicyclic and tricyclic thiophenes as protein tyrosine phosphatase 1B inhibitors. Bioorg Med Chem14:2162-77 (2006) 
 
Tyrosine-protein phosphatase non-receptor type 2
Name:Tyrosine-protein phosphatase non-receptor type 2
Type:Protein
Mol. Mass.:48481.80
Organism:Homo sapiens (Human)
Description:P17706
Residue:415
BDBM14239
BDBM13466
NameBDBM14239
Synonyms:5-(carboxymethoxy)-10-{[1-(phenylmethane)sulfonylpiperidin-4-yl]amino}-3,7-dithiatricyclo[6.4.0.0^{2,6}]dodeca-1(8),2(6),4,9,11-pentaene-4-carboxylic acid | thienobenzothiophene 29
TypeSmall organic molecule
Emp. Form.C25H24N2O7S3
Mol. Mass.560.662
SMILESOC(=O)COc1c(sc2c1sc1cc(NC3CCN(CC3)S(=O)(=O)Cc3ccccc3)ccc21)C(O)=O