Reaction Details
TargetProtein arginine N-methyltransferase 5
LigandBDBM336993
Substrate/Competitorn/a
Meas. Tech.Biochemical Assay
IC50<100±n/a nM
Citation Duncan, KWChesworth, RBoriack-Sjodin, PAMunchhof, MJJin, L PRMT5 inhibitors and uses thereof US Patent US9765068 Publication Date 9/19/2017
 
Protein arginine N-methyltransferase 5
Name:Protein arginine N-methyltransferase 5
Type:Enzyme
Mol. Mass.:72679.99
Organism:Homo sapiens (Human)
Description:O14744
Residue:637
BDBM336993
NameBDBM336993
Synonyms:US9745291, Compound 39 | US9765068, Compound 39
TypeSmall organic molecule
Emp. Form.C24H27N3O3
Mol. Mass.405.4895
SMILESCC(Oc1cccc2cccnc12)C(=O)NCC(O)CN1CCc2ccccc2C1