Reaction Details
TargetProtein arginine N-methyltransferase 5
LigandBDBM337040
Substrate/Competitorn/a
Meas. Tech.Biochemical Assay
IC50<100±n/a nM
Citation Duncan, KWChesworth, RBoriack-Sjodin, PAMunchhof, MJJin, L PRMT5 inhibitors and uses thereof US Patent US9765068 Publication Date 9/19/2017
 
Protein arginine N-methyltransferase 5
Name:Protein arginine N-methyltransferase 5
Type:Enzyme
Mol. Mass.:72679.99
Organism:Homo sapiens (Human)
Description:O14744
Residue:637
BDBM337040
NameBDBM337040
Synonyms:US9745291, Compound 86 | US9765068, Compound 86
TypeSmall organic molecule
Emp. Form.C26H35N3O5
Mol. Mass.469.5732
SMILESO[C@@H](CNC(=O)COc1ccccc1OCCN1CCOCC1)CN1CCc2ccccc2C1