Reaction Details
TargetProtein arginine N-methyltransferase 5
LigandBDBM337050
Substrate/Competitorn/a
Meas. Tech.Biochemical Assay
IC50<100±n/a nM
Citation Duncan, KWChesworth, RBoriack-Sjodin, PAMunchhof, MJJin, L PRMT5 inhibitors and uses thereof US Patent US9765068 Publication Date 9/19/2017
 
Protein arginine N-methyltransferase 5
Name:Protein arginine N-methyltransferase 5
Type:Enzyme
Mol. Mass.:72679.99
Organism:Homo sapiens (Human)
Description:O14744
Residue:637
BDBM337050
NameBDBM337050
Synonyms:US9745291, Compound 96 | US9765068, Compound 96
TypeSmall organic molecule
Emp. Form.C26H33N5O3
Mol. Mass.463.5719
SMILESCN1CCC(C1)n1ncc2cc(OCC(=O)NCC(O)CN3CCc4ccccc4C3)ccc12