Reaction Details
TargetProtein arginine N-methyltransferase 5
LigandBDBM337055
Substrate/Competitorn/a
Meas. Tech.Biochemical Assay
IC50<100±n/a nM
Citation Duncan, KWChesworth, RBoriack-Sjodin, PAMunchhof, MJJin, L PRMT5 inhibitors and uses thereof US Patent US9765068 Publication Date 9/19/2017
 
Protein arginine N-methyltransferase 5
Name:Protein arginine N-methyltransferase 5
Type:Enzyme
Mol. Mass.:72679.99
Organism:Homo sapiens (Human)
Description:O14744
Residue:637
BDBM337055
NameBDBM337055
Synonyms:US9745291, Compound 101 | US9765068, Compound 101
TypeSmall organic molecule
Emp. Form.C25H31N3O4
Mol. Mass.437.5313
SMILESCC(=O)N1CCc2c(C1)cccc2OCC(=O)NCC(O)CN1CCc2ccccc2C1