Reaction Details
TargetProtein arginine N-methyltransferase 5
LigandBDBM337056
Substrate/Competitorn/a
Meas. Tech.Biochemical Assay
IC50<100±n/a nM
Citation Duncan, KWChesworth, RBoriack-Sjodin, PAMunchhof, MJJin, L PRMT5 inhibitors and uses thereof US Patent US9765068 Publication Date 9/19/2017
 
Protein arginine N-methyltransferase 5
Name:Protein arginine N-methyltransferase 5
Type:Enzyme
Mol. Mass.:72679.99
Organism:Homo sapiens (Human)
Description:O14744
Residue:637
BDBM337056
NameBDBM337056
Synonyms:US9745291, Compound 102 | US9765068, Compound 102
TypeSmall organic molecule
Emp. Form.C24H31N3O5S
Mol. Mass.473.585
SMILESCS(=O)(=O)N1CCc2c(C1)cccc2OCC(=O)NCC(O)CN1CCc2ccccc2C1