Reaction Details
TargetProtein arginine N-methyltransferase 5
LigandBDBM337061
Substrate/Competitorn/a
Meas. Tech.Biochemical Assay
IC50<100±n/a nM
Citation Duncan, KWChesworth, RBoriack-Sjodin, PAMunchhof, MJJin, L PRMT5 inhibitors and uses thereof US Patent US9765068 Publication Date 9/19/2017
 
Protein arginine N-methyltransferase 5
Name:Protein arginine N-methyltransferase 5
Type:Enzyme
Mol. Mass.:72679.99
Organism:Homo sapiens (Human)
Description:O14744
Residue:637
BDBM337061
NameBDBM337061
Synonyms:US9745291, Compound 107 | US9765068, Compound 107
TypeSmall organic molecule
Emp. Form.C24H32N4O5S
Mol. Mass.488.6
SMILESOC(CNC(=O)COc1ccccc1S(=O)(=O)N1CCNCC1)CN1CCc2ccccc2C1