Reaction Details
TargetProtein arginine N-methyltransferase 5
LigandBDBM337065
Substrate/Competitorn/a
Meas. Tech.Biochemical Assay
IC50<100±n/a nM
Citation Duncan, KWChesworth, RBoriack-Sjodin, PAMunchhof, MJJin, L PRMT5 inhibitors and uses thereof US Patent US9765068 Publication Date 9/19/2017
 
Protein arginine N-methyltransferase 5
Name:Protein arginine N-methyltransferase 5
Type:Enzyme
Mol. Mass.:72679.99
Organism:Homo sapiens (Human)
Description:O14744
Residue:637
BDBM337065
NameBDBM337065
Synonyms:US9745291, Compound 111 | US9765068, Compound 111
TypeSmall organic molecule
Emp. Form.C24H31N3O6S
Mol. Mass.489.584
SMILESOC(CNC(=O)COc1ccccc1S(=O)(=O)N1CCC(O)C1)CN1CCc2ccccc2C1