Reaction Details
TargetProtein arginine N-methyltransferase 5
LigandBDBM337107
Substrate/Competitorn/a
Meas. Tech.Biochemical Assay
IC50<100±n/a nM
Citation Duncan, KWChesworth, RBoriack-Sjodin, PAMunchhof, MJJin, L PRMT5 inhibitors and uses thereof US Patent US9765068 Publication Date 9/19/2017
 
Protein arginine N-methyltransferase 5
Name:Protein arginine N-methyltransferase 5
Type:Enzyme
Mol. Mass.:72679.99
Organism:Homo sapiens (Human)
Description:O14744
Residue:637
BDBM337107
NameBDBM337107
Synonyms:US9745291, Compound 153 | US9765068, Compound 153
TypeSmall organic molecule
Emp. Form.C24H28N4O3
Mol. Mass.420.5041
SMILESCn1cnc(c1)-c1ccccc1OCC(=O)NCC(O)CN1CCc2ccccc2C1