Reaction Details
TargetProtein arginine N-methyltransferase 5
LigandBDBM337112
Substrate/Competitorn/a
Meas. Tech.Biochemical Assay
IC50<100±n/a nM
Citation Duncan, KWChesworth, RBoriack-Sjodin, PAMunchhof, MJJin, L PRMT5 inhibitors and uses thereof US Patent US9765068 Publication Date 9/19/2017
 
Protein arginine N-methyltransferase 5
Name:Protein arginine N-methyltransferase 5
Type:Enzyme
Mol. Mass.:72679.99
Organism:Homo sapiens (Human)
Description:O14744
Residue:637
BDBM337112
NameBDBM337112
Synonyms:US9745291, Compound 158 | US9765068, Compound 158
TypeSmall organic molecule
Emp. Form.C23H28N4O3
Mol. Mass.408.4934
SMILESCc1nn(C)c2cccc(OCC(=O)NCC(O)CN3CCc4ccccc4C3)c12