Reaction Details
TargetProtein arginine N-methyltransferase 5
LigandBDBM337113
Substrate/Competitorn/a
Meas. Tech.Biochemical Assay
IC50<100±n/a nM
Citation Duncan, KWChesworth, RBoriack-Sjodin, PAMunchhof, MJJin, L PRMT5 inhibitors and uses thereof US Patent US9765068 Publication Date 9/19/2017
 
Protein arginine N-methyltransferase 5
Name:Protein arginine N-methyltransferase 5
Type:Enzyme
Mol. Mass.:72679.99
Organism:Homo sapiens (Human)
Description:O14744
Residue:637
BDBM337113
NameBDBM337113
Synonyms:US9745291, Compound 159 | US9765068, Compound 159
TypeSmall organic molecule
Emp. Form.C22H26N4O3
Mol. Mass.394.4668
SMILESCn1ncc2ccc(OCC(=O)NC[C@H](O)CN3CCc4ccccc4C3)cc12