Reaction Details
TargetProtein arginine N-methyltransferase 5
LigandBDBM337118
Substrate/Competitorn/a
Meas. Tech.Biochemical Assay
IC50<100±n/a nM
Citation Duncan, KWChesworth, RBoriack-Sjodin, PAMunchhof, MJJin, L PRMT5 inhibitors and uses thereof US Patent US9765068 Publication Date 9/19/2017
 
Protein arginine N-methyltransferase 5
Name:Protein arginine N-methyltransferase 5
Type:Enzyme
Mol. Mass.:72679.99
Organism:Homo sapiens (Human)
Description:O14744
Residue:637
BDBM337118
NameBDBM337118
Synonyms:US9745291, Compound 164 | US9765068, Compound 164
TypeSmall organic molecule
Emp. Form.C24H29N3O3
Mol. Mass.407.5054
SMILESCc1cn(C)c2cccc(OCC(=O)NC[C@@H](O)CN3CCc4ccccc4C3)c12