Reaction Details
TargetTryptophan 5-hydroxylase 1
LigandBDBM341399
Substrate/Competitorn/a
Meas. Tech.Biochemical In Vitro Assay
IC50 4.00±n/a nM
Citation Bur, DGrisostomi, CNayler, ORemen, LVercauteren, MWelford, R Tricyclic piperidine compounds US Patent US9765092 Publication Date 9/19/2017
 
Tryptophan 5-hydroxylase 1
Name:Tryptophan 5-hydroxylase 1
Type:PROTEIN
Mol. Mass.:50990.64
Organism:Homo sapiens (Human)
Description:ChEMBL_1361824
Residue:444
BDBM341399
NameBDBM341399
Synonyms:6-chloro-5-(2-(5-(4-cyclopropyl-2-fluorophenyl)-2-methyl-7,8-dihydro-[1,3,4]thiadiazolo[2',3':2,3]imidazo[4,5-c]pyridin-6(5H)-yl)-2-oxoethoxy)-N,N-dimethylpicolinamide | US9765092, Example 1.6.25
TypeSmall organic molecule
Emp. Form.C27H26ClFN6O3S
Mol. Mass.569.05
SMILESCN(C)C(=O)c1ccc(OCC(=O)N2CCc3nc4sc(C)nn4c3C2c2ccc(cc2F)C2CC2)c(Cl)n1