Reaction Details
TargetTryptophan 5-hydroxylase 1
LigandBDBM341523
Substrate/Competitorn/a
Meas. Tech.Biochemical In Vitro Assay
IC50 2.00±n/a nM
Citation Bur, DGrisostomi, CNayler, ORemen, LVercauteren, MWelford, R Tricyclic piperidine compounds US Patent US9765092 Publication Date 9/19/2017
 
Tryptophan 5-hydroxylase 1
Name:Tryptophan 5-hydroxylase 1
Type:PROTEIN
Mol. Mass.:50990.64
Organism:Homo sapiens (Human)
Description:ChEMBL_1361824
Residue:444
BDBM341523
NameBDBM341523
Synonyms:1-(5-(5-chloro-3-fluoropyridin-2-yl)-2-methyl-7,8-dihydro[1,3,4]thiadiazolo[2',3':2,3]imidazo[4,5-c]pyridin-6(5H)-yl)-2-((2-chloro-6-morpholinopyridin-3-yl)oxy)ethanone | US9765092, Example 1.33.1
TypeSmall organic molecule
Emp. Form.C24H22Cl2FN7O3S
Mol. Mass.578.446
SMILESCc1nn2c3C(N(CCc3nc2s1)C(=O)COc1ccc(nc1Cl)N1CCOCC1)c1ncc(Cl)cc1F