Reaction Details
TargetTryptophan 5-hydroxylase 1
LigandBDBM341627
Substrate/Competitorn/a
Meas. Tech.Biochemical In Vitro Assay
IC50 5.00±n/a nM
Citation Bur, DGrisostomi, CNayler, ORemen, LVercauteren, MWelford, R Tricyclic piperidine compounds US Patent US9765092 Publication Date 9/19/2017
 
Tryptophan 5-hydroxylase 1
Name:Tryptophan 5-hydroxylase 1
Type:PROTEIN
Mol. Mass.:50990.64
Organism:Homo sapiens (Human)
Description:ChEMBL_1361824
Residue:444
BDBM341627
NameBDBM341627
Synonyms:2-(2-chloro-4-(morpholinomethyl)phenoxy)-1-(5-(2-fluoro-4-methoxyphenyl)-7,8-dihydrothiazolo[2',3':2,3]-imidazo[4,5-c]pyridin-6(5H)-yl)ethanone | US9765092, Example 6.3.1
TypeSmall organic molecule
Emp. Form.C28H28ClFN4O4S
Mol. Mass.571.063
SMILESCOc1ccc(C2N(CCc3nc4sccn4c23)C(=O)COc2ccc(CN3CCOCC3)cc2Cl)c(F)c1