Reaction Details
TargetTryptophan 5-hydroxylase 1
LigandBDBM341636
Substrate/Competitorn/a
Meas. Tech.Biochemical In Vitro Assay
IC50 4.00±n/a nM
Citation Bur, DGrisostomi, CNayler, ORemen, LVercauteren, MWelford, R Tricyclic piperidine compounds US Patent US9765092 Publication Date 9/19/2017
 
Tryptophan 5-hydroxylase 1
Name:Tryptophan 5-hydroxylase 1
Type:PROTEIN
Mol. Mass.:50990.64
Organism:Homo sapiens (Human)
Description:ChEMBL_1361824
Residue:444
BDBM341636
NameBDBM341636
Synonyms:1-(5-(4-chloro-2-fluorophenyl)-7,8-dihydrothiazolo-[2',3':2,3]imidazo[4,5-c]pyridin-6(5H)-yl)-2-((2-chloro-6-morpholinopyridin-3-yl)oxy)ethanone | US9765092, Example 6.4.6
TypeSmall organic molecule
Emp. Form.C25H22Cl2FN5O3S
Mol. Mass.562.443
SMILESFc1cc(Cl)ccc1C1N(CCc2nc3sccn3c12)C(=O)COc1ccc(nc1Cl)N1CCOCC1