Reaction Details
TargetTryptophan 5-hydroxylase 1
LigandBDBM341713
Substrate/Competitorn/a
Meas. Tech.Biochemical In Vitro Assay
IC50 2.00±n/a nM
Citation Bur, DGrisostomi, CNayler, ORemen, LVercauteren, MWelford, R Tricyclic piperidine compounds US Patent US9765092 Publication Date 9/19/2017
 
Tryptophan 5-hydroxylase 1
Name:Tryptophan 5-hydroxylase 1
Type:PROTEIN
Mol. Mass.:50990.64
Organism:Homo sapiens (Human)
Description:ChEMBL_1361824
Residue:444
BDBM341713
NameBDBM341713
Synonyms:1-(6-Chloro-5-(2-(5-(4-chloro-2-fluorophenyl)-2-methyl-7,8-dihydro-[1,3,4]thiadiazolo[2',3':2,3]imidazo[4,5-c]pyridin-6(5H)-yl)-2-oxoethoxy)pyridin-2-yl)pyrrolidin-2-one | US9765092, Example 1.4.17
TypeSmall organic molecule
Emp. Form.C25H21Cl2FN6O3S
Mol. Mass.575.442
SMILESCc1nn2c3C(N(CCc3nc2s1)C(=O)COc1ccc(nc1Cl)N1CCCC1=O)c1ccc(Cl)cc1F