Reaction Details
TargetTryptophan 5-hydroxylase 1
LigandBDBM341757
Substrate/Competitorn/a
Meas. Tech.Biochemical In Vitro Assay
IC50 5.00±n/a nM
Citation Bur, DGrisostomi, CNayler, ORemen, LVercauteren, MWelford, R Tricyclic piperidine compounds US Patent US9765092 Publication Date 9/19/2017
 
Tryptophan 5-hydroxylase 1
Name:Tryptophan 5-hydroxylase 1
Type:PROTEIN
Mol. Mass.:50990.64
Organism:Homo sapiens (Human)
Description:ChEMBL_1361824
Residue:444
BDBM341757
NameBDBM341757
Synonyms:2-(6-(2-((2-Chloro-6-morpholinopyridin-3-yl)oxy)acetyl)-2-methyl-5,6,7,8-tetrahydro-[1,3,4]thiadiazolo[2',3':2,3]imidazo[4,5-c]pyridin-5-yl)-N-methylthiazole-4-carboxamide | US9765092, Example 1.44.2
TypeSmall organic molecule
Emp. Form.C24H25ClN8O4S2
Mol. Mass.589.09
SMILESCNC(=O)c1csc(n1)C1N(CCc2nc3sc(C)nn3c12)C(=O)COc1ccc(nc1Cl)N1CCOCC1