Reaction Details
TargetRibosomal protein S6 kinase alpha-2
LigandBDBM286086
Substrate/Competitorn/a
Meas. Tech.Kinase Assay
IC50>1000±n/a nM
Citation Dunn, SEJayanthan, ANagireddy, JRAnnedi, SVan Drie, JHDaynard, TSHuynh, M Substituted tetrahydropyrido[3′,2′:4,5]pyrrolo[1,2-a]pyrazine-2-carboxamides as RSK inhibitors US Patent US9771366 Publication Date 9/26/2017
 
Ribosomal protein S6 kinase alpha-2
Name:Ribosomal protein S6 kinase alpha-2
Type:Serine/threonine-protein kinase
Mol. Mass.:83259.46
Organism:Homo sapiens (Human)
Description:n/a
Residue:733
BDBM286086
NameBDBM286086
Synonyms:1-benzyl-N-(2-methyl-1,2,3,4-tetrahydrobenzofuro[3,2-c]pyridin-8-yl)-1H-pyrazole-4-carboxamide US10758530, Compound 13 | US9771366, Compound 13
TypeSmall organic molecule
Emp. Form.C23H22N4O2
Mol. Mass.386.4464
SMILESCN1CCc2oc3ccc(NC(=O)c4cnn(Cc5ccccc5)c4)cc3c2C1