Reaction Details
TargetMast/stem cell growth factor receptor Kit
LigandBDBM342164
Substrate/Competitorn/a
Meas. Tech.Biochemical Assay
Ki 500±n/a nM
Citation Lin, JPham, PBuell, JSpevak, W Compounds and methods for kinase modulation, and indications therefor US Patent US9771369 Publication Date 9/26/2017
 
Mast/stem cell growth factor receptor Kit
Name:Mast/stem cell growth factor receptor Kit
Type:Protein
Mol. Mass.:109869.37
Organism:Homo sapiens (Human)
Description:P10721
Residue:976
BDBM342164
NameBDBM342164
Synonyms:4-[4-[4-(4-cyclopropyl-5-phenyl-1H- imidazol-2-yl)-1-piperidyl]-7H- pyrrolo[2,3-d]pyrimidin-6- yl]benzonitrile | US9771369, Compound P-3010
TypeSmall organic molecule
Emp. Form.C30H27N7
Mol. Mass.485.5823
SMILESN#Cc1ccc(cc1)-c1cc2c(ncnc2[nH]1)N1CCC(CC1)c1nc(C2CC2)c([nH]1)-c1ccccc1