Reaction Details
TargetMast/stem cell growth factor receptor Kit
LigandBDBM342209
Substrate/Competitorn/a
Meas. Tech.Biochemical Assay
Ki 500±n/a nM
Citation Lin, JPham, PBuell, JSpevak, W Compounds and methods for kinase modulation, and indications therefor US Patent US9771369 Publication Date 9/26/2017
 
Mast/stem cell growth factor receptor Kit
Name:Mast/stem cell growth factor receptor Kit
Type:Protein
Mol. Mass.:109869.37
Organism:Homo sapiens (Human)
Description:P10721
Residue:976
BDBM342209
NameBDBM342209
Synonyms:4-[4-[5-(4-methoxyphenyl)-4-methyl- 1H-imidazol-2-yl]-4-methyl-1- piperidyl]-6-(2-methoxy-4-pyridyl)-7H- pyrrolo[2,3-d]pyrimidine | US9771369, Compound P-3041
TypeSmall organic molecule
Emp. Form.C29H31N7O2
Mol. Mass.509.6021
SMILESCOc1ccc(cc1)-c1[nH]c(nc1C)C1(C)CCN(CC1)c1ncnc2[nH]c(cc12)-c1ccnc(OC)c1