Reaction Details
TargetMast/stem cell growth factor receptor Kit
LigandBDBM342214
Substrate/Competitorn/a
Meas. Tech.Biochemical Assay
Ki 500±n/a nM
Citation Lin, JPham, PBuell, JSpevak, W Compounds and methods for kinase modulation, and indications therefor US Patent US9771369 Publication Date 9/26/2017
 
Mast/stem cell growth factor receptor Kit
Name:Mast/stem cell growth factor receptor Kit
Type:Protein
Mol. Mass.:109869.37
Organism:Homo sapiens (Human)
Description:P10721
Residue:976
BDBM342214
NameBDBM342214
Synonyms:4-[4-(4-methyl-5-phenyl-1H-imidazol-2- yl)-1-piperidyl]-6-(1-methylpyrazol-4- yl)-7H-pyrrolo[2,3-d]pyrimidine | US9771369, Compound P-3046
TypeSmall organic molecule
Emp. Form.C25H26N8
Mol. Mass.438.5275
SMILESCc1nc([nH]c1-c1ccccc1)C1CCN(CC1)c1ncnc2[nH]c(cc12)-c1cnn(C)c1