Reaction Details
TargetMast/stem cell growth factor receptor Kit
LigandBDBM342340
Substrate/Competitorn/a
Meas. Tech.Biochemical Assay
Ki 500±n/a nM
Citation Lin, JPham, PBuell, JSpevak, W Compounds and methods for kinase modulation, and indications therefor US Patent US9771369 Publication Date 9/26/2017
 
Mast/stem cell growth factor receptor Kit
Name:Mast/stem cell growth factor receptor Kit
Type:Protein
Mol. Mass.:109869.37
Organism:Homo sapiens (Human)
Description:P10721
Residue:976
BDBM342340
NameBDBM342340
Synonyms:4-[4-[4-[5-(6-methoxy-3-pyridyl)-4- methyl-1H-imidazol-2-yl]-4-methyl-1- piperidyl]-7H-pyrrolo[2,3-d]pyrimidin- 6-yl]benzonitrile | US9771369, Compound P-3172
TypeSmall organic molecule
Emp. Form.C29H28N8O
Mol. Mass.504.5856
SMILESCOc1ccc(cn1)-c1[nH]c(nc1C)C1(C)CCN(CC1)c1ncnc2[nH]c(cc12)-c1ccc(cc1)C#N