Reaction Details
TargetSodium channel protein type 9 subunit alpha
LigandBDBM145255
Substrate/Competitorn/a
Meas. Tech.Electrophysiological Assay (In Vitro Assay)
IC50 65.8±n/a nM
Citation Chowdhury, SDehnhardt, CMFocken, TGrimwood, MEHemeon, IWJia, QOrtwine, DFSafina, BSun, SSutherlin, DPZenova, AY N-substituted benzamides and methods of use thereof US Patent US9771376 Publication Date 9/26/2017
 
Sodium channel protein type 9 subunit alpha
Name:Sodium channel protein type 9 subunit alpha
Type:Protein
Mol. Mass.:226375.97
Organism:Homo sapiens (Human)
Description:Q15858
Residue:1988
BDBM145255
NameBDBM145255
Synonyms:US8952169, 34 | US9771376, Example 34
TypeSmall organic molecule
Emp. Form.C19H26ClFN2O4S
Mol. Mass.432.937
SMILESCN(C)S(=O)(=O)NC(=O)c1cc(Cl)c(OC[C@H]2CC[C@H]3C[C@@H]2C3(C)C)cc1F