Reaction Details
TargetSodium channel protein type 9 subunit alpha
LigandBDBM145327
Substrate/Competitorn/a
Meas. Tech.Electrophysiological Assay (In Vitro Assay)
IC50 84.7±n/a nM
Citation Chowdhury, SDehnhardt, CMFocken, TGrimwood, MEHemeon, IWJia, QOrtwine, DFSafina, BSun, SSutherlin, DPZenova, AY N-substituted benzamides and methods of use thereof US Patent US9771376 Publication Date 9/26/2017
 
Sodium channel protein type 9 subunit alpha
Name:Sodium channel protein type 9 subunit alpha
Type:Protein
Mol. Mass.:226375.97
Organism:Homo sapiens (Human)
Description:Q15858
Residue:1988
BDBM145327
NameBDBM145327
Synonyms:US8952169, 106 | US9771376, Example 106
TypeSmall organic molecule
Emp. Form.C16H18ClF4NO4S
Mol. Mass.431.83
SMILESCS(=O)(=O)NC(=O)c1cc(Cl)c(OC[C@H]2CC[C@@H](CC2)C(F)(F)F)cc1F