Reaction Details
TargetHistone deacetylase 4
LigandBDBM345231
Substrate/Competitorn/a
Meas. Tech.Inhibition Assay
IC50 48.0±n/a nM
Citation Dominguez, CMuñoz-Sanjuán, IMaillard, MRaphy, GHaughan, AFLuckhurst, CAJarvis, REBürli, RWBreccia, PWishart, GHughes, SJAllen, DRPenrose, SD Histone deacetylase inhibitors and compositions and methods of use thereof US Patent US9783488 Publication Date 10/10/2017
 
Histone deacetylase 4
Name:Histone deacetylase 4
Type:Enzyme
Mol. Mass.:119049.39
Organism:Homo sapiens (Human)
Description:P56524
Residue:1084
BDBM345231
NameBDBM345231
Synonyms:(1S,3S*)-1-(3-Fluoro-2- methylphenyl)-N-hydroxy- 3-(quinolin-6- yl)cyclopentanecarboxamide | US9783488, Example 84
TypeSmall organic molecule
Emp. Form.C22H21FN2O2
Mol. Mass.364.4127
SMILESCc1c(F)cccc1[C@@]1(CC[C@@H](C1)c1ccc2ncccc2c1)C(=O)NO