Reaction Details
TargetDihydroorotate dehydrogenase (quinone), mitochondrial
LigandBDBM14711
Substrate/CompetitorBDBM14700
Meas. Tech.DHODH Inhibition Assay
pH8±n/a
Temperature298.15±n/a K
Ki 30±n/a nM
IC50 230±120 nM
Km13400±n/a nM
Citation Heikkila, TRamsey, CDavies, MGaltier, CStead, AMJohnson, APFishwick, CWBoa, ANMcConkey, GA Design and synthesis of potent inhibitors of the malaria parasite dihydroorotate dehydrogenase. J Med Chem50:186-91 (2007) 
 
Dihydroorotate dehydrogenase (quinone), mitochondrial
Name:Dihydroorotate dehydrogenase (quinone), mitochondrial
Type:Enzyme
Mol. Mass.:65581.88
Organism:Plasmodium falciparum (isolate 3D7)
Description:Q08210
Residue:569
BDBM14711
BDBM14700
NameBDBM14711
Synonyms:Asinex compound no. 6 benzamide compound 3
TypeSmall organic molecule
Emp. Form.C14H10Cl2N2O3
Mol. Mass.325.147
SMILESCc1c(cccc1[N+]([O-])=O)C(=O)Nc1cc(Cl)cc(Cl)c1