Reaction Details
TargetDihydroorotate dehydrogenase (quinone), mitochondrial
LigandBDBM14711
Substrate/CompetitorBDBM14700
Meas. Tech.DHODH Inhibition Assay
Ki 64400±n/a nM
IC50 524400±n/a nM
Citation Heikkila, TRamsey, CDavies, MGaltier, CStead, AMJohnson, APFishwick, CWBoa, ANMcConkey, GA Design and synthesis of potent inhibitors of the malaria parasite dihydroorotate dehydrogenase. J Med Chem50:186-91 (2007) 
 
Dihydroorotate dehydrogenase (quinone), mitochondrial
Name:Dihydroorotate dehydrogenase (quinone), mitochondrial
Type:Enzyme
Mol. Mass.:42881.33
Organism:Homo sapiens (Human)
Description:Q02127
Residue:395
BDBM14711
BDBM14700
NameBDBM14711
Synonyms:Asinex compound no. 6 benzamide compound 3
TypeSmall organic molecule
Emp. Form.C14H10Cl2N2O3
Mol. Mass.325.147
SMILESCc1c(cccc1[N+]([O-])=O)C(=O)Nc1cc(Cl)cc(Cl)c1