Reaction Details
TargetCarbonic anhydrase 1
LigandBDBM14736
Substrate/CompetitorBDBM11326
Meas. Tech.Esterase Assay
pH7.5±n/a
Temperature298.15±n/a K
Ki 3±n/a nM
Citation Casey, JRMorgan, PEVullo, DScozzafava, AMastrolorenzo, ASupuran, CT Carbonic anhydrase inhibitors. Design of selective, membrane-impermeant inhibitors targeting the human tumor-associated isozyme IX. J Med Chem47:2337-47 (2004) 
 
Carbonic anhydrase 1
Name:Carbonic anhydrase 1
Type:Enzyme
Mol. Mass.:28873.37
Organism:Homo sapiens (Human)
Description:P00915
Residue:261
BDBM14736
BDBM11326
NameBDBM14736
Synonyms:1-N-[5-Sulfamoyl-1,3,4-thiadiazol-2-yl-(aminosulfonyl-4-phenyl)]-2,3,4,6-tetramethylpyridinium perchlorate pyridinium-containing sulfonamide analog 14t
TypeSmall organic molecule
Emp. Form.C17H20N5O4S3
Mol. Mass.454.566
SMILESCc1cc(C)[n+](c(C)c1C)-c1ccc(cc1)S(=O)(=O)Nc1nnc(s1)S(N)(=O)=O