Reaction Details
TargetCarbonic anhydrase 2
LigandBDBM14720
Substrate/CompetitorBDBM11326
Meas. Tech.Esterase Assay
Ki 1.54±n/a nM
Citation Casey, JRMorgan, PEVullo, DScozzafava, AMastrolorenzo, ASupuran, CT Carbonic anhydrase inhibitors. Design of selective, membrane-impermeant inhibitors targeting the human tumor-associated isozyme IX. J Med Chem47:2337-47 (2004) 
 
Carbonic anhydrase 2
Name:Carbonic anhydrase 2
Type:Enzyme
Mol. Mass.:29250.71
Organism:Homo sapiens (Human)
Description:P00918
Residue:260
BDBM14720
BDBM11326
NameBDBM14720
Synonyms:1-N-[5-Sulfamoyl-1,3,4-thiadiazol-2-yl-(aminosulfonyl-4-phenyl)]-2,6-diisopropyl-4-methylpyridinium perchlorate pyridinium-containing sulfonamide analog 14c
TypeSmall organic molecule
Emp. Form.C20H26N5O4S3
Mol. Mass.496.646
SMILESCC(C)c1cc(C)cc(C(C)C)[n+]1-c1ccc(cc1)S(=O)(=O)Nc1nnc(s1)S(N)(=O)=O