Reaction Details
TargetCarbonic anhydrase 4
LigandBDBM14730
Substrate/CompetitorBDBM11326
Meas. Tech.Esterase Assay
Ki 4.5±n/a nM
Citation Casey, JRMorgan, PEVullo, DScozzafava, AMastrolorenzo, ASupuran, CT Carbonic anhydrase inhibitors. Design of selective, membrane-impermeant inhibitors targeting the human tumor-associated isozyme IX. J Med Chem47:2337-47 (2004) 
 
Carbonic anhydrase 4
Name:Carbonic anhydrase 4
Type:Enzyme
Mol. Mass.:35152.74
Organism:Bos taurus (bovine)
Description:Bovine isozyme, isolated from lung microsomes
Residue:312
BDBM14730
BDBM11326
NameBDBM14730
Synonyms:1-N-[5-Sulfamoyl-1,3,4-thiadiazol-2-yl-(aminosulfonyl-4-phenyl)]-2-isopropyl-4,6-diphenylpyridinium perchlorate pyridinium-containing sulfonamide analog 14n
TypeSmall organic molecule
Emp. Form.C28H26N5O4S3
Mol. Mass.592.732
SMILESCC(C)c1cc(cc(-c2ccccc2)[n+]1-c1ccc(cc1)S(=O)(=O)Nc1nnc(s1)S(N)(=O)=O)-c1ccccc1