Reaction Details
TargetCarbonic anhydrase 4
LigandBDBM14733
Substrate/CompetitorBDBM11326
Meas. Tech.Esterase Assay
Ki 5.8±n/a nM
Citation Casey, JRMorgan, PEVullo, DScozzafava, AMastrolorenzo, ASupuran, CT Carbonic anhydrase inhibitors. Design of selective, membrane-impermeant inhibitors targeting the human tumor-associated isozyme IX. J Med Chem47:2337-47 (2004) 
 
Carbonic anhydrase 4
Name:Carbonic anhydrase 4
Type:Enzyme
Mol. Mass.:35152.74
Organism:Bos taurus (bovine)
Description:Bovine isozyme, isolated from lung microsomes
Residue:312
BDBM14733
BDBM11326
NameBDBM14733
Synonyms:4-methyl-2,6-diphenyl-1-{4-[(5-sulfamoyl-1,3,4-thiadiazol-2-yl)sulfamoyl]phenyl}-1-pyridin-1-ylium perchlorate | pyridinium-containing sulfonamide analog 14q
TypeSmall organic molecule
Emp. Form.C26H22N5O4S3
Mol. Mass.564.678
SMILESCc1cc(-c2ccccc2)[n+](-c2ccc(cc2)S(=O)(=O)Nc2nnc(s2)S(N)(=O)=O)c(c1)-c1ccccc1